Reaction Details
TargetProtein kinase C theta type
LigandBDBM50049441
Substrate/Competitorn/a
Meas. Tech.ChEMBL_1454725 (CHEMBL3362644)
IC50 55±n/a nM
Citation George, DMBreinlinger, ECFriedman, MZhang, YWang, JArgiriadi, MBansal-Pakala, PBarth, MDuignan, DBHonore, PLang, QMittelstadt, SPotin, DRundell, LEdmunds, JJ Discovery of selective and orally bioavailable protein kinase C¿ (PKC¿) inhibitors from a fragment hit. J Med Chem58:222-36 (2015) 
 
Protein kinase C theta type
Name:Protein kinase C theta type
Type:Serine/threonine-protein kinase
Mol. Mass.:81878.04
Organism:Homo sapiens (Human)
Description:Full-length human PKC theta (Panvera Catalog No. P2996).
Residue:706
BDBM50049441
NameBDBM50049441
Synonyms:CHEMBL3356470
TypeSmall organic molecule
Emp. Form.C15H19N5O2
Mol. Mass.301.3437
SMILESC[C@H]1N2C(COc3cc(C)c(NC4CNC4)cc23)=NNC1=O