Reaction Details
TargetProtein kinase C theta type
LigandBDBM50049435
Substrate/Competitorn/a
Meas. Tech.ChEMBL_1454724 (CHEMBL3362643)
IC50 19000±n/a nM
Citation George, DMBreinlinger, ECFriedman, MZhang, YWang, JArgiriadi, MBansal-Pakala, PBarth, MDuignan, DBHonore, PLang, QMittelstadt, SPotin, DRundell, LEdmunds, JJ Discovery of selective and orally bioavailable protein kinase C¿ (PKC¿) inhibitors from a fragment hit. J Med Chem58:222-36 (2015) 
 
Protein kinase C theta type
Name:Protein kinase C theta type
Type:Serine/threonine-protein kinase
Mol. Mass.:81878.04
Organism:Homo sapiens (Human)
Description:Full-length human PKC theta (Panvera Catalog No. P2996).
Residue:706
BDBM50049435
NameBDBM50049435
Synonyms:CHEMBL1968515
TypeSmall organic molecule
Emp. Form.C10H9N3O2
Mol. Mass.203.1974
SMILESO=C1CN2C(COc3ccccc23)=NN1