Reaction Details
TargetCarbonic anhydrase 2
LigandBDBM50049520
Substrate/Competitorn/a
Meas. Tech.ChEMBL_1450310 (CHEMBL3377547)
Ki 4.4±n/a nM
Citation Ceruso, MDel Prete, SAlOthman, ZOsman, SMScozzafava, ACapasso, CSupuran, CT Synthesis of sulfonamides with effective inhibitory action against Porphyromonas gingivalis¿-carbonic anhydrase. Bioorg Med Chem Lett24:4006-10 (2014) 
 
Carbonic anhydrase 2
Name:Carbonic anhydrase 2
Type:Enzyme
Mol. Mass.:29250.71
Organism:Homo sapiens (Human)
Description:P00918
Residue:260
BDBM50049520
NameBDBM50049520
Synonyms:CHEMBL3314185
TypeSmall organic molecule
Emp. Form.C22H27N3O7S
Mol. Mass.477.531
SMILESCOC(=O)C(CCCCNC(=O)OCc1ccccc1)NC(=O)c1ccc(cc1)S(N)(=O)=O