Reaction Details
TargetAngiotensin-converting enzyme
LigandBDBM50188508
Substrate/Competitorn/a
Meas. Tech.ChEMBL_1454785 (CHEMBL3363246)
IC50 208000000±n/a nM
Citation Wu, SQi, WSu, RLi, TLu, DHe, Z CoMFA and CoMSIA analysis of ACE-inhibitory, antimicrobial and bitter-tasting peptides. Eur J Med Chem84:100-6 (2014) 
 
Angiotensin-converting enzyme
Name:Angiotensin-converting enzyme
Type:Enzyme
Mol. Mass.:149709.01
Organism:Homo sapiens (Human)
Description:n/a
Residue:1306
BDBM50188508
NameBDBM50188508
Synonyms:(S)-2-(2-Amino-acetylamino)-3-(4-hydroxy-phenyl)-propionic acid CHEMBL53400 | Gly-Tyr
TypeSmall organic molecule
Emp. Form.C11H14N2O4
Mol. Mass.238.2399
SMILESNCC(=O)N[C@@H](Cc1ccc(O)cc1)C(O)=O