Reaction Details
TargetPotassium channel subfamily K member 3
LigandBDBM50050457
Substrate/Competitorn/a
Meas. Tech.ChEMBL_1457493 (CHEMBL3367860)
IC50 250±n/a nM
Citation Flaherty, DPSimpson, DSMiller, MMaki, BEZou, BShi, JWu, MMcManus, OBAubé, JLi, MGolden, JE Potent and selective inhibitors of the TASK-1 potassium channel through chemical optimization of a bis-amide scaffold. Bioorg Med Chem Lett24:3968-73 (2014) 
 
Potassium channel subfamily K member 3
Name:Potassium channel subfamily K member 3
Type:Protein
Mol. Mass.:43534.71
Organism:Homo sapiens (Human)
Description:O14649
Residue:394
BDBM50050457
NameBDBM50050457
Synonyms:CHEMBL3188245
TypeSmall organic molecule
Emp. Form.C19H15N3O2
Mol. Mass.317.3413
SMILESO=C(Nc1cccc(NC(=O)c2ccncc2)c1)c1ccccc1