Reaction Details
TargetPotassium channel subfamily K member 3
LigandBDBM50050497
Substrate/Competitorn/a
Meas. Tech.ChEMBL_1457493 (CHEMBL3367860)
IC50 190±n/a nM
Citation Flaherty, DPSimpson, DSMiller, MMaki, BEZou, BShi, JWu, MMcManus, OBAubé, JLi, MGolden, JE Potent and selective inhibitors of the TASK-1 potassium channel through chemical optimization of a bis-amide scaffold. Bioorg Med Chem Lett24:3968-73 (2014) 
 
Potassium channel subfamily K member 3
Name:Potassium channel subfamily K member 3
Type:Protein
Mol. Mass.:43534.71
Organism:Homo sapiens (Human)
Description:O14649
Residue:394
BDBM50050497
NameBDBM50050497
Synonyms:CHEMBL3181946
TypeSmall organic molecule
Emp. Form.C25H26N2O2
Mol. Mass.386.4861
SMILESCc1cccc(c1)C(=O)Nc1cccc(NC(=O)c2ccc(cc2)C(C)(C)C)c1