Reaction Details
TargetPotassium channel subfamily K member 3
LigandBDBM50050541
Substrate/Competitorn/a
Meas. Tech.ChEMBL_1457493 (CHEMBL3367860)
IC50 4.0±n/a nM
Citation Flaherty, DPSimpson, DSMiller, MMaki, BEZou, BShi, JWu, MMcManus, OBAubé, JLi, MGolden, JE Potent and selective inhibitors of the TASK-1 potassium channel through chemical optimization of a bis-amide scaffold. Bioorg Med Chem Lett24:3968-73 (2014) 
 
Potassium channel subfamily K member 3
Name:Potassium channel subfamily K member 3
Type:Protein
Mol. Mass.:43534.71
Organism:Homo sapiens (Human)
Description:O14649
Residue:394
BDBM50050541
NameBDBM50050541
Synonyms:CHEMBL3188749
TypeSmall organic molecule
Emp. Form.C22H17F3N2O4
Mol. Mass.430.3766
SMILESCOc1ccccc1C(=O)Nc1cccc(NC(=O)c2ccccc2OC(F)(F)F)c1