Reaction Details
TargetPotassium channel subfamily K member 9
LigandBDBM50050433
Substrate/Competitorn/a
Meas. Tech.ChEMBL_1457494 (CHEMBL3367861)
IC50 23000±n/a nM
Citation Flaherty, DPSimpson, DSMiller, MMaki, BEZou, BShi, JWu, MMcManus, OBAubé, JLi, MGolden, JE Potent and selective inhibitors of the TASK-1 potassium channel through chemical optimization of a bis-amide scaffold. Bioorg Med Chem Lett24:3968-73 (2014) 
 
Potassium channel subfamily K member 9
Name:Potassium channel subfamily K member 9
Type:PROTEIN
Mol. Mass.:42276.04
Organism:Homo sapiens (Human)
Description:ChEMBL_1457494
Residue:374
BDBM50050433
NameBDBM50050433
Synonyms:CHEMBL3186489
TypeSmall organic molecule
Emp. Form.C20H16N2O2
Mol. Mass.316.3532
SMILESO=C(Nc1cccc(NC(=O)c2ccccc2)c1)c1ccccc1