Reaction Details
TargetPotassium channel subfamily K member 9
LigandBDBM50050438
Substrate/Competitorn/a
Meas. Tech.ChEMBL_1457494 (CHEMBL3367861)
IC50 20000±n/a nM
Citation Flaherty, DPSimpson, DSMiller, MMaki, BEZou, BShi, JWu, MMcManus, OBAubé, JLi, MGolden, JE Potent and selective inhibitors of the TASK-1 potassium channel through chemical optimization of a bis-amide scaffold. Bioorg Med Chem Lett24:3968-73 (2014) 
 
Potassium channel subfamily K member 9
Name:Potassium channel subfamily K member 9
Type:PROTEIN
Mol. Mass.:42276.04
Organism:Homo sapiens (Human)
Description:ChEMBL_1457494
Residue:374
BDBM50050438
NameBDBM50050438
Synonyms:CHEMBL3184075
TypeSmall organic molecule
Emp. Form.C20H15FN2O2
Mol. Mass.334.3437
SMILESFc1ccc(cc1)C(=O)Nc1cccc(NC(=O)c2ccccc2)c1