Reaction Details
TargetPotassium voltage-gated channel subfamily H member 2
LigandBDBM50050495
Substrate/Competitorn/a
Meas. Tech.ChEMBL_1457497 (CHEMBL3367864)
IC50 12400±n/a nM
Citation Flaherty, DPSimpson, DSMiller, MMaki, BEZou, BShi, JWu, MMcManus, OBAubé, JLi, MGolden, JE Potent and selective inhibitors of the TASK-1 potassium channel through chemical optimization of a bis-amide scaffold. Bioorg Med Chem Lett24:3968-73 (2014) 
 
Potassium voltage-gated channel subfamily H member 2
Name:Potassium voltage-gated channel subfamily H member 2
Type:Multi-pass membrane protein
Mol. Mass.:126672.65
Organism:Homo sapiens (Human)
Description:Q12809
Residue:1159
BDBM50050495
NameBDBM50050495
Synonyms:CHEMBL3185736
TypeSmall organic molecule
Emp. Form.C22H20N2O2
Mol. Mass.344.4064
SMILESCc1cccc(c1)C(=O)Nc1cccc(NC(=O)c2cccc(C)c2)c1