Reaction Details
TargetPotassium voltage-gated channel subfamily KQT member 2
LigandBDBM50312125
Substrate/Competitorn/a
Meas. Tech.ChEMBL_1457496 (CHEMBL3367863)
IC50>30000±n/a nM
Citation Flaherty, DPSimpson, DSMiller, MMaki, BEZou, BShi, JWu, MMcManus, OBAubé, JLi, MGolden, JE Potent and selective inhibitors of the TASK-1 potassium channel through chemical optimization of a bis-amide scaffold. Bioorg Med Chem Lett24:3968-73 (2014) 
 
Potassium voltage-gated channel subfamily KQT member 2
Name:Potassium voltage-gated channel subfamily KQT member 2
Type:PROTEIN
Mol. Mass.:95883.20
Organism:Homo sapiens (Human)
Description:ChEMBL_1457496
Residue:872
BDBM50312125
NameBDBM50312125
Synonyms:3-chloro-N-(3-(3-methylbenzamido)phenyl)benzamide | CHEMBL1086899
TypeSmall organic molecule
Emp. Form.C21H17ClN2O2
Mol. Mass.364.825
SMILESCc1cccc(c1)C(=O)Nc1cccc(NC(=O)c2cccc(Cl)c2)c1