Reaction Details
TargetPotassium channel subfamily K member 3
LigandBDBM50312105
Substrate/Competitorn/a
Meas. Tech.ChEMBL_1457501 (CHEMBL3367868)
IC50 16±n/a nM
Citation Flaherty, DPSimpson, DSMiller, MMaki, BEZou, BShi, JWu, MMcManus, OBAubé, JLi, MGolden, JE Potent and selective inhibitors of the TASK-1 potassium channel through chemical optimization of a bis-amide scaffold. Bioorg Med Chem Lett24:3968-73 (2014) 
 
Potassium channel subfamily K member 3
Name:Potassium channel subfamily K member 3
Type:Protein
Mol. Mass.:43534.71
Organism:Homo sapiens (Human)
Description:O14649
Residue:394
BDBM50312105
NameBDBM50312105
Synonyms:2-methoxy-N-(3-(3-methylbenzamido)phenyl)benzamide | CHEMBL1081188
TypeSmall organic molecule
Emp. Form.C22H20N2O3
Mol. Mass.360.4058
SMILESCOc1ccccc1C(=O)Nc1cccc(NC(=O)c2cccc(C)c2)c1