Reaction Details
TargetPotassium channel subfamily K member 3
LigandBDBM50050503
Substrate/Competitorn/a
Meas. Tech.ChEMBL_1457501 (CHEMBL3367868)
IC50 11±n/a nM
Citation Flaherty, DPSimpson, DSMiller, MMaki, BEZou, BShi, JWu, MMcManus, OBAubé, JLi, MGolden, JE Potent and selective inhibitors of the TASK-1 potassium channel through chemical optimization of a bis-amide scaffold. Bioorg Med Chem Lett24:3968-73 (2014) 
 
Potassium channel subfamily K member 3
Name:Potassium channel subfamily K member 3
Type:Protein
Mol. Mass.:43534.71
Organism:Homo sapiens (Human)
Description:O14649
Residue:394
BDBM50050503
NameBDBM50050503
Synonyms:CHEMBL3187482
TypeSmall organic molecule
Emp. Form.C23H22N2O3
Mol. Mass.374.4324
SMILESCCOc1ccccc1C(=O)Nc1cccc(NC(=O)c2cccc(C)c2)c1