Reaction Details
TargetPotassium channel subfamily K member 9
LigandBDBM50050503
Substrate/Competitorn/a
Meas. Tech.ChEMBL_1457502 (CHEMBL3367869)
IC50 38±n/a nM
Citation Flaherty, DPSimpson, DSMiller, MMaki, BEZou, BShi, JWu, MMcManus, OBAubé, JLi, MGolden, JE Potent and selective inhibitors of the TASK-1 potassium channel through chemical optimization of a bis-amide scaffold. Bioorg Med Chem Lett24:3968-73 (2014) 
 
Potassium channel subfamily K member 9
Name:Potassium channel subfamily K member 9
Type:PROTEIN
Mol. Mass.:42276.04
Organism:Homo sapiens (Human)
Description:ChEMBL_1457494
Residue:374
BDBM50050503
NameBDBM50050503
Synonyms:CHEMBL3187482
TypeSmall organic molecule
Emp. Form.C23H22N2O3
Mol. Mass.374.4324
SMILESCCOc1ccccc1C(=O)Nc1cccc(NC(=O)c2cccc(C)c2)c1