Reaction Details
TargetPotassium channel subfamily K member 9
LigandBDBM50050540
Substrate/Competitorn/a
Meas. Tech.ChEMBL_1457502 (CHEMBL3367869)
IC50 710±n/a nM
Citation Flaherty, DPSimpson, DSMiller, MMaki, BEZou, BShi, JWu, MMcManus, OBAubé, JLi, MGolden, JE Potent and selective inhibitors of the TASK-1 potassium channel through chemical optimization of a bis-amide scaffold. Bioorg Med Chem Lett24:3968-73 (2014) 
 
Potassium channel subfamily K member 9
Name:Potassium channel subfamily K member 9
Type:PROTEIN
Mol. Mass.:42276.04
Organism:Homo sapiens (Human)
Description:ChEMBL_1457494
Residue:374
BDBM50050540
NameBDBM50050540
Synonyms:CHEMBL3182359
TypeSmall organic molecule
Emp. Form.C22H20N2O4
Mol. Mass.376.4052
SMILESCOc1ccccc1C(=O)Nc1cccc(NC(=O)c2ccccc2OC)c1