Reaction Details
TargetPolymerase basic protein 2
LigandBDBM50050721
Substrate/Competitorn/a
Meas. Tech.ChEMBL_1458393 (CHEMBL3369823)
Kd 300±n/a nM
Citation Clark, MPLedeboer, MWDavies, IByrn, RAJones, SMPerola, ETsai, AJacobs, MNti-Addae, KBandarage, UKBoyd, MJBethiel, RSCourt, JJDeng, HDuffy, JPDorsch, WAFarmer, LJGao, HGu, WJackson, KJacobs, DHKennedy, JMLedford, BLiang, JMaltais, FMurcko, MWang, TWannamaker, MWBennett, HBLeeman, JRMcNeil, CTaylor, WPMemmott, CJiang, MRijnbrand, RBral, CGermann, UNezami, AZhang, YSalituro, FGBennani, YLCharifson, PS Discovery of a novel, first-in-class, orally bioavailable azaindole inhibitor (VX-787) of influenza PB2. J Med Chem57:6668-78 (2014) 
 
Polymerase basic protein 2
Name:Polymerase basic protein 2
Type:PROTEIN
Mol. Mass.:86120.80
Organism:Influenza A virus (strain A/Puerto Rico/8/1934 H1N1)
Description:ChEMBL_109460
Residue:759
BDBM50050721
NameBDBM50050721
Synonyms:CHEMBL3317973
TypeSmall organic molecule
Emp. Form.C19H20ClFN6O
Mol. Mass.402.853
SMILESCC(=O)N1CCC[C@H](CNc2nc(ncc2F)-c2c[nH]c3ncc(Cl)cc23)C1