Reaction Details
TargetCarbonic anhydrase 1
LigandBDBM50050841
Substrate/Competitorn/a
Meas. Tech.ChEMBL_1459252 (CHEMBL3367482)
Ki>20000±n/a nM
Citation De Monte, CCarradori, SSecci, DD'Ascenzio, MVullo, DCeruso, MSupuran, CT Cyclic tertiary sulfamates: selective inhibition of the tumor-associated carbonic anhydrases IX and XII by N- and O-substituted acesulfame derivatives. Eur J Med Chem84:240-6 (2014) 
 
Carbonic anhydrase 1
Name:Carbonic anhydrase 1
Type:Enzyme
Mol. Mass.:28873.37
Organism:Homo sapiens (Human)
Description:P00915
Residue:261
BDBM50050841
NameBDBM50050841
Synonyms:CHEMBL3322444
TypeSmall organic molecule
Emp. Form.C11H10N2O6S
Mol. Mass.298.272
SMILESCC1=CC(=O)N(Cc2ccccc2[N+]([O-])=O)S(=O)(=O)O1