Reaction Details
TargetCarbonic anhydrase 2
LigandBDBM50050840
Substrate/Competitorn/a
Meas. Tech.ChEMBL_1459253 (CHEMBL3367483)
Ki>20000±n/a nM
Citation De Monte, CCarradori, SSecci, DD'Ascenzio, MVullo, DCeruso, MSupuran, CT Cyclic tertiary sulfamates: selective inhibition of the tumor-associated carbonic anhydrases IX and XII by N- and O-substituted acesulfame derivatives. Eur J Med Chem84:240-6 (2014) 
 
Carbonic anhydrase 2
Name:Carbonic anhydrase 2
Type:Enzyme
Mol. Mass.:29250.71
Organism:Homo sapiens (Human)
Description:P00918
Residue:260
BDBM50050840
NameBDBM50050840
Synonyms:CHEMBL3322445
TypeSmall organic molecule
Emp. Form.C11H10N2O6S
Mol. Mass.298.272
SMILESCC1=CC(OCc2ccccc2[N+]([O-])=O)=NS(=O)(=O)O1