Reaction Details
TargetSerine/threonine-protein kinase pim-1
LigandBDBM50050847
Substrate/Competitorn/a
Meas. Tech.ChEMBL_1459268 (CHEMBL3367498)
IC50>100000±n/a nM
Citation Defaux, JAntoine, MLogé, CLe Borgne, MSchuster, TSeipelt, IAicher, BTeifel, MGünther, EGerlach, MMarchand, P Discovery of (7-aryl-1,5-naphthyridin-2-yl)ureas as dual inhibitors of ERK2 and Aurora B kinases with antiproliferative activity against cancer cells. Bioorg Med Chem Lett24:3748-52 (2014) 
 
Serine/threonine-protein kinase pim-1
Name:Serine/threonine-protein kinase pim-1
Type:Protein
Mol. Mass.:35681.82
Organism:Homo sapiens (Human)
Description:P11309
Residue:313
BDBM50050847
NameBDBM50050847
Synonyms:CHEMBL3318027
TypeSmall organic molecule
Emp. Form.C17H20N6O
Mol. Mass.324.3803
SMILESCn1cc(cn1)-c1cnc2ccc(NC(=O)NC(C)(C)C)nc2c1