Reaction Details
TargetHomeodomain-interacting protein kinase 1
LigandBDBM50050848
Substrate/Competitorn/a
Meas. Tech.ChEMBL_1459267 (CHEMBL3367497)
IC50>100000±n/a nM
Citation Defaux, JAntoine, MLogé, CLe Borgne, MSchuster, TSeipelt, IAicher, BTeifel, MGünther, EGerlach, MMarchand, P Discovery of (7-aryl-1,5-naphthyridin-2-yl)ureas as dual inhibitors of ERK2 and Aurora B kinases with antiproliferative activity against cancer cells. Bioorg Med Chem Lett24:3748-52 (2014) 
 
Homeodomain-interacting protein kinase 1
Name:Homeodomain-interacting protein kinase 1
Type:PROTEIN
Mol. Mass.:130868.34
Organism:Homo sapiens (Human)
Description:ChEMBL_1459267
Residue:1210
BDBM50050848
NameBDBM50050848
Synonyms:CHEMBL3318026
TypeSmall organic molecule
Emp. Form.C20H22N4O3
Mol. Mass.366.4137
SMILESCOc1cc(ccc1O)-c1cnc2ccc(NC(=O)NC(C)(C)C)nc2c1