Reaction Details
TargetAurora kinase B
LigandBDBM50050861
Substrate/Competitorn/a
Meas. Tech.ChEMBL_1459266 (CHEMBL3367496)
IC50 86±n/a nM
Citation Defaux, JAntoine, MLogé, CLe Borgne, MSchuster, TSeipelt, IAicher, BTeifel, MGünther, EGerlach, MMarchand, P Discovery of (7-aryl-1,5-naphthyridin-2-yl)ureas as dual inhibitors of ERK2 and Aurora B kinases with antiproliferative activity against cancer cells. Bioorg Med Chem Lett24:3748-52 (2014) 
 
Aurora kinase B
Name:Aurora kinase B
Type:Protein
Mol. Mass.:39327.72
Organism:Homo sapiens (Human)
Description:Q96GD4
Residue:344
BDBM50050861
NameBDBM50050861
Synonyms:CHEMBL3318035
TypeSmall organic molecule
Emp. Form.C21H20N6O
Mol. Mass.372.4231
SMILESCn1cc(cn1)-c1cnc2c(NC(=O)NCCc3ccccc3)ccnc2c1