Reaction Details
TargetHomeodomain-interacting protein kinase 1
LigandBDBM50050850
Substrate/Competitorn/a
Meas. Tech.ChEMBL_1459267 (CHEMBL3367497)
IC50 13600±n/a nM
Citation Defaux, JAntoine, MLogé, CLe Borgne, MSchuster, TSeipelt, IAicher, BTeifel, MGünther, EGerlach, MMarchand, P Discovery of (7-aryl-1,5-naphthyridin-2-yl)ureas as dual inhibitors of ERK2 and Aurora B kinases with antiproliferative activity against cancer cells. Bioorg Med Chem Lett24:3748-52 (2014) 
 
Homeodomain-interacting protein kinase 1
Name:Homeodomain-interacting protein kinase 1
Type:PROTEIN
Mol. Mass.:130868.34
Organism:Homo sapiens (Human)
Description:ChEMBL_1459267
Residue:1210
BDBM50050850
NameBDBM50050850
Synonyms:CHEMBL3318024
TypeSmall organic molecule
Emp. Form.C19H20N4O3
Mol. Mass.352.3871
SMILESCCNC(=O)Nc1ccc2ncc(cc2n1)-c1ccc(OC)c(OC)c1