Reaction Details
TargetTyrosine-protein kinase ABL1
LigandBDBM50050850
Substrate/Competitorn/a
Meas. Tech.ChEMBL_1459271 (CHEMBL3367501)
IC50>100000±n/a nM
Citation Defaux, JAntoine, MLogé, CLe Borgne, MSchuster, TSeipelt, IAicher, BTeifel, MGünther, EGerlach, MMarchand, P Discovery of (7-aryl-1,5-naphthyridin-2-yl)ureas as dual inhibitors of ERK2 and Aurora B kinases with antiproliferative activity against cancer cells. Bioorg Med Chem Lett24:3748-52 (2014) 
 
Tyrosine-protein kinase ABL1
Name:Tyrosine-protein kinase ABL1
Type:Enzyme
Mol. Mass.:122897.30
Organism:Homo sapiens (Human)
Description:P00519
Residue:1130
BDBM50050850
NameBDBM50050850
Synonyms:CHEMBL3318024
TypeSmall organic molecule
Emp. Form.C19H20N4O3
Mol. Mass.352.3871
SMILESCCNC(=O)Nc1ccc2ncc(cc2n1)-c1ccc(OC)c(OC)c1