Reaction Details
TargetAdenosylhomocysteinase
LigandBDBM50050862
Substrate/Competitorn/a
Meas. Tech.ChEMBL_1459289 (CHEMBL3367519)
Ki 1.5±n/a nM
Citation Nakao, ASuzuki, HUeno, HIwasaki, HSetsuta, T Discovery of S-adenosyl-L-homocysteine hydrolase inhibitors based on non-adenosine analogs. Bioorg Med Chem Lett24:4336-40 (2014) 
 
Adenosylhomocysteinase
Name:Adenosylhomocysteinase
Type:PROTEIN
Mol. Mass.:47714.06
Organism:Homo sapiens (Human)
Description:ChEMBL_1507791
Residue:432
BDBM50050862
NameBDBM50050862
Synonyms:CHEMBL3322562
TypeSmall organic molecule
Emp. Form.C28H32Cl3N5O3
Mol. Mass.592.944
SMILESCl.CNCCNC(=O)CN(CC(=O)N(C)N1Cc2ccccc2C1)c1cc(Cl)ccc1Oc1ccc(Cl)cc1