Reaction Details
TargetPeroxisome proliferator-activated receptor gamma
LigandBDBM50273681
Substrate/Competitorn/a
Meas. Tech.ChEMBL_1460054 (CHEMBL3368588)
EC50 3000±n/a nM
Citation Lamers, CDittrich, MSteri, RProschak, ESchubert-Zsilavecz, M Molecular determinants for improved activity at PPARa: structure-activity relationship of pirinixic acid derivatives, docking study and site-directed mutagenesis of PPARa. Bioorg Med Chem Lett24:4048-52 (2014) 
 
Peroxisome proliferator-activated receptor gamma
Name:Peroxisome proliferator-activated receptor gamma
Type:Nuclear Receptor
Mol. Mass.:57613.46
Organism:Homo sapiens (Human)
Description:P37231
Residue:505
BDBM50273681
NameBDBM50273681
Synonyms:2-(4-chloro-6-(2,3-dimethylphenylamino)pyrimidin-2-ylthio)hexanoic acid | CHEMBL459972
TypeSmall organic molecule
Emp. Form.C18H22ClN3O2S
Mol. Mass.379.904
SMILESCCCCC(Sc1nc(Cl)cc(Nc2cccc(C)c2C)n1)C(O)=O