Reaction Details
TargetCarbonic anhydrase 2
LigandBDBM50050906
Substrate/Competitorn/a
Meas. Tech.ChEMBL_1460062 (CHEMBL3368596)
Ki 9.5±n/a nM
Citation Chegaev, KLazzarato, LTamboli, YBoschi, DBlangetti, MScozzafava, ACarta, FMasini, EFruttero, RSupuran, CTGasco, A Furazan and furoxan sulfonamides are stronga-carbonic anhydrase inhibitors and potential antiglaucoma agents. Bioorg Med Chem22:3913-21 (2014) 
 
Carbonic anhydrase 2
Name:Carbonic anhydrase 2
Type:Enzyme
Mol. Mass.:29250.71
Organism:Homo sapiens (Human)
Description:P00918
Residue:260
BDBM50050906
NameBDBM50050906
Synonyms:CHEMBL3309854
TypeSmall organic molecule
Emp. Form.C14H11N3O7S2
Mol. Mass.397.383
SMILESNS(=O)(=O)c1ccc(Oc2no[n+]([O-])c2S(=O)(=O)c2ccccc2)cc1