Reaction Details
TargetCarbonic anhydrase 12
LigandBDBM50050909
Substrate/Competitorn/a
Meas. Tech.ChEMBL_1460064 (CHEMBL3368598)
Ki 8.3±n/a nM
Citation Chegaev, KLazzarato, LTamboli, YBoschi, DBlangetti, MScozzafava, ACarta, FMasini, EFruttero, RSupuran, CTGasco, A Furazan and furoxan sulfonamides are stronga-carbonic anhydrase inhibitors and potential antiglaucoma agents. Bioorg Med Chem22:3913-21 (2014) 
 
Carbonic anhydrase 12
Name:Carbonic anhydrase 12
Type:Enzyme
Mol. Mass.:39456.00
Organism:Homo sapiens (Human)
Description:Catalytic domain of human cloned isozyme was used in the assay
Residue:354
BDBM50050909
NameBDBM50050909
Synonyms:CHEMBL3309363
TypeSmall organic molecule
Emp. Form.C14H11N3O4S
Mol. Mass.317.32
SMILESNS(=O)(=O)c1ccc(cc1)-c1no[n+]([O-])c1-c1ccccc1