Reaction Details
TargetCarbonic anhydrase 12
LigandBDBM50050912
Substrate/Competitorn/a
Meas. Tech.ChEMBL_1460064 (CHEMBL3368598)
Ki 82±n/a nM
Citation Chegaev, KLazzarato, LTamboli, YBoschi, DBlangetti, MScozzafava, ACarta, FMasini, EFruttero, RSupuran, CTGasco, A Furazan and furoxan sulfonamides are stronga-carbonic anhydrase inhibitors and potential antiglaucoma agents. Bioorg Med Chem22:3913-21 (2014) 
 
Carbonic anhydrase 12
Name:Carbonic anhydrase 12
Type:Enzyme
Mol. Mass.:39456.00
Organism:Homo sapiens (Human)
Description:Catalytic domain of human cloned isozyme was used in the assay
Residue:354
BDBM50050912
NameBDBM50050912
Synonyms:CHEMBL3309366
TypeSmall organic molecule
Emp. Form.C8H6N4O6S
Mol. Mass.286.221
SMILESNS(=O)(=O)c1ccc(cc1)-c1c(no[n+]1[O-])[N+]([O-])=O