Reaction Details
TargetCarbonic anhydrase 12
LigandBDBM50050920
Substrate/Competitorn/a
Meas. Tech.ChEMBL_1460064 (CHEMBL3368598)
Ki 3.9±n/a nM
Citation Chegaev, KLazzarato, LTamboli, YBoschi, DBlangetti, MScozzafava, ACarta, FMasini, EFruttero, RSupuran, CTGasco, A Furazan and furoxan sulfonamides are stronga-carbonic anhydrase inhibitors and potential antiglaucoma agents. Bioorg Med Chem22:3913-21 (2014) 
 
Carbonic anhydrase 12
Name:Carbonic anhydrase 12
Type:Enzyme
Mol. Mass.:39456.00
Organism:Homo sapiens (Human)
Description:Catalytic domain of human cloned isozyme was used in the assay
Residue:354
BDBM50050920
NameBDBM50050920
Synonyms:CHEMBL3309369
TypeSmall organic molecule
Emp. Form.C14H11N3O3S2
Mol. Mass.333.385
SMILESNS(=O)(=O)c1ccc(cc1)-c1nonc1Sc1ccccc1