Reaction Details
TargetCarbonic anhydrase 12
LigandBDBM50050921
Substrate/Competitorn/a
Meas. Tech.ChEMBL_1460064 (CHEMBL3368598)
Ki 3.8±n/a nM
Citation Chegaev, KLazzarato, LTamboli, YBoschi, DBlangetti, MScozzafava, ACarta, FMasini, EFruttero, RSupuran, CTGasco, A Furazan and furoxan sulfonamides are stronga-carbonic anhydrase inhibitors and potential antiglaucoma agents. Bioorg Med Chem22:3913-21 (2014) 
 
Carbonic anhydrase 12
Name:Carbonic anhydrase 12
Type:Enzyme
Mol. Mass.:39456.00
Organism:Homo sapiens (Human)
Description:Catalytic domain of human cloned isozyme was used in the assay
Residue:354
BDBM50050921
NameBDBM50050921
Synonyms:CHEMBL3309370
TypeSmall organic molecule
Emp. Form.C14H11N3O4S2
Mol. Mass.349.385
SMILESNS(=O)(=O)c1ccc(cc1)-c1c(Sc2ccccc2)no[n+]1[O-]