Reaction Details
TargetCarbonic anhydrase 12
LigandBDBM50050959
Substrate/Competitorn/a
Meas. Tech.ChEMBL_1460064 (CHEMBL3368598)
Ki 7.6±n/a nM
Citation Chegaev, KLazzarato, LTamboli, YBoschi, DBlangetti, MScozzafava, ACarta, FMasini, EFruttero, RSupuran, CTGasco, A Furazan and furoxan sulfonamides are stronga-carbonic anhydrase inhibitors and potential antiglaucoma agents. Bioorg Med Chem22:3913-21 (2014) 
 
Carbonic anhydrase 12
Name:Carbonic anhydrase 12
Type:Enzyme
Mol. Mass.:39456.00
Organism:Homo sapiens (Human)
Description:Catalytic domain of human cloned isozyme was used in the assay
Residue:354
BDBM50050959
NameBDBM50050959
Synonyms:CHEMBL3309354
TypeSmall organic molecule
Emp. Form.C3H5N3O4S
Mol. Mass.179.154
SMILESCc1no[n+]([O-])c1S(N)(=O)=O