Reaction Details
TargetCarbonic anhydrase 12
LigandBDBM50051030
Substrate/Competitorn/a
Meas. Tech.ChEMBL_1460064 (CHEMBL3368598)
Ki 6.3±n/a nM
Citation Chegaev, KLazzarato, LTamboli, YBoschi, DBlangetti, MScozzafava, ACarta, FMasini, EFruttero, RSupuran, CTGasco, A Furazan and furoxan sulfonamides are stronga-carbonic anhydrase inhibitors and potential antiglaucoma agents. Bioorg Med Chem22:3913-21 (2014) 
 
Carbonic anhydrase 12
Name:Carbonic anhydrase 12
Type:Enzyme
Mol. Mass.:39456.00
Organism:Homo sapiens (Human)
Description:Catalytic domain of human cloned isozyme was used in the assay
Residue:354
BDBM50051030
NameBDBM50051030
Synonyms:CHEMBL3309361
TypeSmall organic molecule
Emp. Form.C8H7N3O4S
Mol. Mass.241.224
SMILESNS(=O)(=O)c1nonc1Oc1ccccc1