Reaction Details
TargetCarbonic anhydrase 9
LigandBDBM50050908
Substrate/Competitorn/a
Meas. Tech.ChEMBL_1460063 (CHEMBL3368597)
Ki 63±n/a nM
Citation Chegaev, KLazzarato, LTamboli, YBoschi, DBlangetti, MScozzafava, ACarta, FMasini, EFruttero, RSupuran, CTGasco, A Furazan and furoxan sulfonamides are stronga-carbonic anhydrase inhibitors and potential antiglaucoma agents. Bioorg Med Chem22:3913-21 (2014) 
 
Carbonic anhydrase 9
Name:Carbonic anhydrase 9
Type:Enzyme
Mol. Mass.:49669.03
Organism:Homo sapiens (Human)
Description:Catalytic domain of human cloned isozyme was used in the assay
Residue:459
BDBM50050908
NameBDBM50050908
Synonyms:CHEMBL3309362
TypeSmall organic molecule
Emp. Form.C14H11N3O3S
Mol. Mass.301.32
SMILESNS(=O)(=O)c1ccc(cc1)-c1nonc1-c1ccccc1