Reaction Details
TargetCarbonic anhydrase 9
LigandBDBM50050910
Substrate/Competitorn/a
Meas. Tech.ChEMBL_1460063 (CHEMBL3368597)
Ki 58±n/a nM
Citation Chegaev, KLazzarato, LTamboli, YBoschi, DBlangetti, MScozzafava, ACarta, FMasini, EFruttero, RSupuran, CTGasco, A Furazan and furoxan sulfonamides are stronga-carbonic anhydrase inhibitors and potential antiglaucoma agents. Bioorg Med Chem22:3913-21 (2014) 
 
Carbonic anhydrase 9
Name:Carbonic anhydrase 9
Type:Enzyme
Mol. Mass.:49669.03
Organism:Homo sapiens (Human)
Description:Catalytic domain of human cloned isozyme was used in the assay
Residue:459
BDBM50050910
NameBDBM50050910
Synonyms:CHEMBL3309364
TypeSmall organic molecule
Emp. Form.C14H11N3O4S
Mol. Mass.317.32
SMILESNS(=O)(=O)c1ccc(cc1)-c1c(no[n+]1[O-])-c1ccccc1