Reaction Details
TargetCarbonic anhydrase 1
LigandBDBM50050912
Substrate/Competitorn/a
Meas. Tech.ChEMBL_1460061 (CHEMBL3368595)
Ki 591±n/a nM
Citation Chegaev, KLazzarato, LTamboli, YBoschi, DBlangetti, MScozzafava, ACarta, FMasini, EFruttero, RSupuran, CTGasco, A Furazan and furoxan sulfonamides are stronga-carbonic anhydrase inhibitors and potential antiglaucoma agents. Bioorg Med Chem22:3913-21 (2014) 
 
Carbonic anhydrase 1
Name:Carbonic anhydrase 1
Type:Enzyme
Mol. Mass.:28873.37
Organism:Homo sapiens (Human)
Description:P00915
Residue:261
BDBM50050912
NameBDBM50050912
Synonyms:CHEMBL3309366
TypeSmall organic molecule
Emp. Form.C8H6N4O6S
Mol. Mass.286.221
SMILESNS(=O)(=O)c1ccc(cc1)-c1c(no[n+]1[O-])[N+]([O-])=O