Reaction Details
TargetCarbonic anhydrase 1
LigandBDBM50050953
Substrate/Competitorn/a
Meas. Tech.ChEMBL_1460061 (CHEMBL3368595)
Ki 354±n/a nM
Citation Chegaev, KLazzarato, LTamboli, YBoschi, DBlangetti, MScozzafava, ACarta, FMasini, EFruttero, RSupuran, CTGasco, A Furazan and furoxan sulfonamides are stronga-carbonic anhydrase inhibitors and potential antiglaucoma agents. Bioorg Med Chem22:3913-21 (2014) 
 
Carbonic anhydrase 1
Name:Carbonic anhydrase 1
Type:Enzyme
Mol. Mass.:28873.37
Organism:Homo sapiens (Human)
Description:P00915
Residue:261
BDBM50050953
NameBDBM50050953
Synonyms:CHEMBL3309374
TypeSmall organic molecule
Emp. Form.C15H13N3O5S
Mol. Mass.347.346
SMILESNS(=O)(=O)c1ccc(OCc2no[n+]([O-])c2-c2ccccc2)cc1