Reaction Details
TargetCarbonic anhydrase 1
LigandBDBM50050901
Substrate/Competitorn/a
Meas. Tech.ChEMBL_1460061 (CHEMBL3368595)
Ki 337±n/a nM
Citation Chegaev, KLazzarato, LTamboli, YBoschi, DBlangetti, MScozzafava, ACarta, FMasini, EFruttero, RSupuran, CTGasco, A Furazan and furoxan sulfonamides are stronga-carbonic anhydrase inhibitors and potential antiglaucoma agents. Bioorg Med Chem22:3913-21 (2014) 
 
Carbonic anhydrase 1
Name:Carbonic anhydrase 1
Type:Enzyme
Mol. Mass.:28873.37
Organism:Homo sapiens (Human)
Description:P00915
Residue:261
BDBM50050901
NameBDBM50050901
Synonyms:CHEMBL3309375
TypeSmall organic molecule
Emp. Form.C10H10N4O5S
Mol. Mass.298.275
SMILESNC(=O)c1nonc1COc1ccc(cc1)S(N)(=O)=O