Reaction Details
TargetCarbonic anhydrase 2
LigandBDBM50050963
Substrate/Competitorn/a
Meas. Tech.ChEMBL_1460062 (CHEMBL3368596)
Ki 11±n/a nM
Citation Chegaev, KLazzarato, LTamboli, YBoschi, DBlangetti, MScozzafava, ACarta, FMasini, EFruttero, RSupuran, CTGasco, A Furazan and furoxan sulfonamides are stronga-carbonic anhydrase inhibitors and potential antiglaucoma agents. Bioorg Med Chem22:3913-21 (2014) 
 
Carbonic anhydrase 2
Name:Carbonic anhydrase 2
Type:Enzyme
Mol. Mass.:29250.71
Organism:Homo sapiens (Human)
Description:P00918
Residue:260
BDBM50050963
NameBDBM50050963
Synonyms:CHEMBL3309355
TypeSmall organic molecule
Emp. Form.C8H7N3O3S
Mol. Mass.225.224
SMILESNS(=O)(=O)c1nonc1-c1ccccc1