Reaction Details
TargetCarbonic anhydrase 2
LigandBDBM50324357
Substrate/Competitorn/a
Meas. Tech.ChEMBL_1460062 (CHEMBL3368596)
Ki 49±n/a nM
Citation Chegaev, KLazzarato, LTamboli, YBoschi, DBlangetti, MScozzafava, ACarta, FMasini, EFruttero, RSupuran, CTGasco, A Furazan and furoxan sulfonamides are stronga-carbonic anhydrase inhibitors and potential antiglaucoma agents. Bioorg Med Chem22:3913-21 (2014) 
 
Carbonic anhydrase 2
Name:Carbonic anhydrase 2
Type:Enzyme
Mol. Mass.:29250.71
Organism:Homo sapiens (Human)
Description:P00918
Residue:260
BDBM50324357
NameBDBM50324357
Synonyms:4-phenyl-3-sulfamoyl-1,2,5-oxadiazole 2-oxide | CHEMBL1215509
TypeSmall organic molecule
Emp. Form.C8H7N3O4S
Mol. Mass.241.224
SMILESNS(=O)(=O)c1c(no[n+]1[O-])-c1ccccc1