Reaction Details
TargetHistone deacetylase 6
LigandBDBM50051031
Substrate/Competitorn/a
Meas. Tech.ChEMBL_1460074 (CHEMBL3368834)
IC50 13±n/a nM
Citation Islam, MNIslam, MSHoque, MAKato, TNishino, NIto, AYoshida, M Bicyclic tetrapeptides as potent HDAC inhibitors: effect of aliphatic loop position and hydrophobicity on inhibitory activity. Bioorg Med Chem22:3862-70 (2014) 
 
Histone deacetylase 6
Name:Histone deacetylase 6
Type:PROTEIN
Mol. Mass.:125762.28
Organism:Mus musculus
Description:ChEMBL_1460074
Residue:1149
BDBM50051031
NameBDBM50051031
Synonyms:CHEMBL2158745
TypeSmall organic molecule
Emp. Form.C29H43N5O7
Mol. Mass.573.681
SMILES[H][C@]12CCCN1C(=O)[C@@]([H])(NC(=O)[C@@H](Cc1ccc(OC)cc1)NC(=O)[C@H](CCCCCC(=O)NO)NC2=O)[C@@H](C)CC