Reaction Details
TargetAndrogen receptor
LigandBDBM50051052
Substrate/Competitorn/a
Meas. Tech.ChEMBL_1460097 (CHEMBL3368857)
IC50 5450±n/a nM
Citation Ban, FLeblanc, ELi, HMunuganti, RSFrewin, KRennie, PSCherkasov, A Discovery of 1H-indole-2-carboxamides as novel inhibitors of the androgen receptor binding function 3 (BF3). J Med Chem57:6867-72 (2014) 
 
Androgen receptor
Name:Androgen receptor
Type:Receptor
Mol. Mass.:99185.27
Organism:Homo sapiens (Human)
Description:CHO cells were stably transfected with human AR gene.
Residue:920
BDBM50051052
NameBDBM50051052
Synonyms:CHEMBL3318060
TypeSmall organic molecule
Emp. Form.C15H13FN2OS
Mol. Mass.288.34
SMILESCN(Cc1cccs1)C(=O)c1cc2ccc(F)cc2[nH]1