Reaction Details
TargetAndrogen receptor
LigandBDBM50051056
Substrate/Competitorn/a
Meas. Tech.ChEMBL_1460097 (CHEMBL3368857)
IC50 6620±n/a nM
Citation Ban, FLeblanc, ELi, HMunuganti, RSFrewin, KRennie, PSCherkasov, A Discovery of 1H-indole-2-carboxamides as novel inhibitors of the androgen receptor binding function 3 (BF3). J Med Chem57:6867-72 (2014) 
 
Androgen receptor
Name:Androgen receptor
Type:Receptor
Mol. Mass.:99185.27
Organism:Homo sapiens (Human)
Description:CHO cells were stably transfected with human AR gene.
Residue:920
BDBM50051056
NameBDBM50051056
Synonyms:CHEMBL3318057
TypeSmall organic molecule
Emp. Form.C17H17FN2O3
Mol. Mass.316.3269
SMILESCOCCN(Cc1ccco1)C(=O)c1cc2cc(F)ccc2[nH]1