Reaction Details
TargetAndrogen receptor
LigandBDBM50051062
Substrate/Competitorn/a
Meas. Tech.ChEMBL_1460103 (CHEMBL3369088)
IC50 2180±n/a nM
Citation Ban, FLeblanc, ELi, HMunuganti, RSFrewin, KRennie, PSCherkasov, A Discovery of 1H-indole-2-carboxamides as novel inhibitors of the androgen receptor binding function 3 (BF3). J Med Chem57:6867-72 (2014) 
 
Androgen receptor
Name:Androgen receptor
Type:Receptor
Mol. Mass.:99185.27
Organism:Homo sapiens (Human)
Description:CHO cells were stably transfected with human AR gene.
Residue:920
BDBM50051062
NameBDBM50051062
Synonyms:CHEMBL3318068
TypeSmall organic molecule
Emp. Form.C18H19FN2O2
Mol. Mass.314.3541
SMILESCC(C)N(Cc1ccc(C)o1)C(=O)c1cc2ccc(F)cc2[nH]1