Reaction Details
TargetSimilar to alpha-tubulin isoform 1
LigandBDBM50051068
Substrate/Competitorn/a
Meas. Tech.ChEMBL_1446866 (CHEMBL3371937)
IC50 1400±n/a nM
Citation Romagnoli, RBaraldi, PGSalvador, MKPrencipe, FBertolasi, VCancellieri, MBrancale, AHamel, ECastagliuolo, IConsolaro, FPorcù, EBasso, GViola, G Synthesis, antimitotic and antivascular activity of 1-(3',4',5'-trimethoxybenzoyl)-3-arylamino-5-amino-1,2,4-triazoles. J Med Chem57:6795-808 (2014) 
 
Similar to alpha-tubulin isoform 1
Name:Similar to alpha-tubulin isoform 1
Synonyms:Similar to alpha-tubulin isoform 1
Type:PROTEIN
Mol. Mass.:10383.05
Organism:Bos taurus
Description:ChEMBL_104716
Residue:99
BDBM50051068
NameBDBM50051068
Synonyms:CHEMBL3318076
TypeSmall organic molecule
Emp. Form.C20H23N5O4
Mol. Mass.397.4277
SMILESCCc1ccc(Nc2nc(N)n(n2)C(=O)c2cc(OC)c(OC)c(OC)c2)cc1