Reaction Details
TargetSimilar to alpha-tubulin isoform 1
LigandBDBM50005480
Substrate/Competitorn/a
Meas. Tech.ChEMBL_1446866 (CHEMBL3371937)
IC50 1200±n/a nM
Citation Romagnoli, RBaraldi, PGSalvador, MKPrencipe, FBertolasi, VCancellieri, MBrancale, AHamel, ECastagliuolo, IConsolaro, FPorcù, EBasso, GViola, G Synthesis, antimitotic and antivascular activity of 1-(3',4',5'-trimethoxybenzoyl)-3-arylamino-5-amino-1,2,4-triazoles. J Med Chem57:6795-808 (2014) 
 
Similar to alpha-tubulin isoform 1
Name:Similar to alpha-tubulin isoform 1
Synonyms:Similar to alpha-tubulin isoform 1
Type:PROTEIN
Mol. Mass.:10383.05
Organism:Bos taurus
Description:ChEMBL_104716
Residue:99
BDBM50005480
NameBDBM50005480
TypeSmall organic molecule
Emp. Form.C18H20O5
Mol. Mass.316.3484
SMILESCOc1ccc(\C=C/c2cc(OC)c(OC)c(OC)c2)cc1O