Reaction Details
TargetCarbonic anhydrase 2
LigandBDBM50051106
Substrate/Competitorn/a
Meas. Tech.ChEMBL_1448691 (CHEMBL3372049)
Ki>10000±n/a nM
Citation D'Ascenzio, MCarradori, SSecci, DVullo, DCeruso, MAkdemir, ASupuran, CT Selective inhibition of human carbonic anhydrases by novel amide derivatives of probenecid: synthesis, biological evaluation and molecular modelling studies. Bioorg Med Chem22:3982-8 (2014) 
 
Carbonic anhydrase 2
Name:Carbonic anhydrase 2
Type:Enzyme
Mol. Mass.:29250.71
Organism:Homo sapiens (Human)
Description:P00918
Residue:260
BDBM50051106
NameBDBM50051106
Synonyms:CHEMBL3311024
TypeSmall organic molecule
Emp. Form.C19H23ClN2O3S
Mol. Mass.394.916
SMILESCCCN(CCC)S(=O)(=O)c1ccc(cc1)C(=O)Nc1cccc(Cl)c1