Reaction Details
TargetCarbonic anhydrase 12
LigandBDBM50051108
Substrate/Competitorn/a
Meas. Tech.ChEMBL_1448693 (CHEMBL3372051)
Ki 418±n/a nM
Citation D'Ascenzio, MCarradori, SSecci, DVullo, DCeruso, MAkdemir, ASupuran, CT Selective inhibition of human carbonic anhydrases by novel amide derivatives of probenecid: synthesis, biological evaluation and molecular modelling studies. Bioorg Med Chem22:3982-8 (2014) 
 
Carbonic anhydrase 12
Name:Carbonic anhydrase 12
Type:Enzyme
Mol. Mass.:39456.00
Organism:Homo sapiens (Human)
Description:Catalytic domain of human cloned isozyme was used in the assay
Residue:354
BDBM50051108
NameBDBM50051108
Synonyms:CHEMBL3310916
TypeSmall organic molecule
Emp. Form.C18H23N3O3S
Mol. Mass.361.459
SMILESCCCN(CCC)S(=O)(=O)c1ccc(cc1)C(=O)Nc1ccccn1