Reaction Details
TargetCarbonic anhydrase 12
LigandBDBM50051105
Substrate/Competitorn/a
Meas. Tech.ChEMBL_1448693 (CHEMBL3372051)
Ki 430±n/a nM
Citation D'Ascenzio, MCarradori, SSecci, DVullo, DCeruso, MAkdemir, ASupuran, CT Selective inhibition of human carbonic anhydrases by novel amide derivatives of probenecid: synthesis, biological evaluation and molecular modelling studies. Bioorg Med Chem22:3982-8 (2014) 
 
Carbonic anhydrase 12
Name:Carbonic anhydrase 12
Type:Enzyme
Mol. Mass.:39456.00
Organism:Homo sapiens (Human)
Description:Catalytic domain of human cloned isozyme was used in the assay
Residue:354
BDBM50051105
NameBDBM50051105
Synonyms:CHEMBL3311025
TypeSmall organic molecule
Emp. Form.C19H23ClN2O3S
Mol. Mass.394.916
SMILESCCCN(CCC)S(=O)(=O)c1ccc(cc1)C(=O)Nc1ccc(Cl)cc1