Reaction Details
TargetN-lysine methyltransferase KMT5A
LigandBDBM50051127
Substrate/Competitorn/a
Meas. Tech.ChEMBL_1450359 (CHEMBL3378196)
IC50 25000±n/a nM
Citation Ma, AYu, WLi, FBleich, RMHerold, JMButler, KVNorris, JLKorboukh, VTripathy, AJanzen, WPArrowsmith, CHFrye, SVVedadi, MBrown, PJJin, J Discovery of a selective, substrate-competitive inhibitor of the lysine methyltransferase SETD8. J Med Chem57:6822-33 (2014) 
 
N-lysine methyltransferase KMT5A
Name:N-lysine methyltransferase KMT5A
Type:Enzyme
Mol. Mass.:42919.11
Organism:Homo sapiens (Human)
Description:Q9NQR1
Residue:393
BDBM50051127
NameBDBM50051127
Synonyms:CHEMBL3318295
TypeSmall organic molecule
Emp. Form.C25H40N6O2
Mol. Mass.456.6241
SMILESCCN1CCN(CCCCCNc2nc(nc3cc(OC)c(OC)cc23)N2CCCC2)CC1