Reaction Details
TargetN-lysine methyltransferase KMT5A
LigandBDBM50051390
Substrate/Competitorn/a
Meas. Tech.ChEMBL_1450359 (CHEMBL3378196)
IC50>250000±n/a nM
Citation Ma, AYu, WLi, FBleich, RMHerold, JMButler, KVNorris, JLKorboukh, VTripathy, AJanzen, WPArrowsmith, CHFrye, SVVedadi, MBrown, PJJin, J Discovery of a selective, substrate-competitive inhibitor of the lysine methyltransferase SETD8. J Med Chem57:6822-33 (2014) 
 
N-lysine methyltransferase KMT5A
Name:N-lysine methyltransferase KMT5A
Type:Enzyme
Mol. Mass.:42919.11
Organism:Homo sapiens (Human)
Description:Q9NQR1
Residue:393
BDBM50051390
NameBDBM50051390
Synonyms:CHEMBL3318307
TypeSmall organic molecule
Emp. Form.C25H39N5O2
Mol. Mass.441.6095
SMILESCOc1cc2nc(NC3CCCCC3)nc(NCCCCCN3CCCC3)c2cc1OC